{"text_format":"1","workbook":"xlsx","n_sheets":10,"sheets":["Instructions - Menu","Percent Based Contract","Flat Rate Contract","Percent Based Voucher","Flat Rate Voucher","Contract Amendment Form","Practice Inspection Form","Group Project Addendum Form","Project Checklist","Technical Assessment"],"not_rendered":{"charts":0,"images":1,"macros":1,"external_links":0,"defined_names":50,"comments":4,"pivot_tables":0},"unopened":[],"bounds":{"document_bytes":16777216,"sheet_cells":100000,"rows_first":2000,"rows_last":500,"rows_between":2000,"halvings":0,"cell_chars":16384,"cell_head_chars":4096},"cells_cut":0,"cells_raw":0,"read":"whole","date_system":"1900"}

{"sheet":"Instructions - Menu","index":0,"n_rows":58,"n_cols":21,"rows_kept":58,"cut":false,"hidden":false,"merged":[[18,2,18,4],[35,2,35,5],[36,2,36,5],[18,5,18,8],[22,12,22,13],[22,9,22,11],[23,9,23,11],[19,2,19,4],[19,5,19,8],[20,2,20,4],[20,5,20,8],[23,2,23,7],[22,2,22,7],[49,6,49,14],[46,6,46,14],[44,6,44,14],[38,6,38,14],[28,2,28,5],[32,9,32,10],[33,9,33,10],[28,9,28,11],[29,9,29,11],[28,12,28,13],[29,12,29,13],[1,2,1,4],[3,2,3,14],[6,2,6,15],[2,2,2,13],[14,5,14,8],[14,9,14,12],[14,2,14,4],[51,6,53,12],[18,9,18,12],[8,2,8,14],[15,3,16,8],[11,9,11,12],[12,9,12,12],[11,2,11,8],[12,2,12,8],[17,2,17,4],[13,5,13,8],[13,2,13,4],[13,9,13,12],[31,2,31,10],[23,12,23,13],[40,6,40,14],[42,6,42,14],[6,18,7,22],[7,2,7,14],[48,6,48,14],[17,9,17,12],[11,13,11,14],[17,13,17,14],[18,13,18,14],[17,5,17,8],[12,13,12,14],[29,2,29,5],[29,6,29,8],[28,6,28,8],[32,2,32,6],[33,2,33,6],[32,7,32,8],[33,7,33,8]]}
[]
[]
[null,null,"Conservation Practice Assistance Contract Workbook"]
[]
[]
[null,null,"Instructions:"]
[null,null,"1.  Copy this template and create/save a specific work file for each cost share application."]
[null,null,"2.  Enter the required application/contract information in the boxes below to populate other forms in the workbook."]
[null,null,"3.  Complete appropriate forms for each eligible application and contract.  Review forms for accuracy. "]
[]
[null,null,"General Information"]
[null,null,"Organization",null,null,null,null,null,null,"Contract Number",null,null,null,"Contract Approval Date"]
[]
[null,null,"Organization Telephone #",null,null,"Installed By Date",null,null,null,"Percent Penalty for noncompliance"]
[]
[]
[null,null,"Applicant"]
[null,null,"Landowner or Authorized Agent",null,null,"Address",null,null,null,"City,State",null,null,null,"Zip Code"]
[]
[null,null,"Landowner or Authorized Agent  Phone Number",null,null,"Landowner or Authorized Agent Email Address"]
{"$rows_left_out":39}
{"sheet":"Percent Based Contract","index":1,"n_rows":59,"n_cols":11,"rows_kept":59,"cut":false,"hidden":false,"merged":[[3,7,3,8],[3,9,3,10],[47,6,47,7],[44,1,45,5],[46,1,46,5],[47,1,47,5],[47,10,47,11],[44,8,45,9],[46,8,46,9],[47,8,47,9],[43,1,43,11],[44,10,45,11],[46,10,46,11],[44,6,44,7],[45,6,45,7],[46,6,46,7],[20,1,20,11],[30,1,30,11],[19,1,19,11],[9,5,9,7],[8,1,8,4],[18,1,18,11],[16,1,17,11],[25,1,25,11],[27,1,27,11],[28,1,28,11],[24,1,24,11],[17,15,17,25],[9,1,9,4],[8,8,8,9],[15,1,15,11],[33,15,33,25],[22,2,22,10],[12,1,12,6],[13,1,13,6],[12,10,12,11],[13,10,13,11],[31,1,31,11],[33,1,33,11],[29,1,29,11],[26,1,26,11],[21,1,21,11],[23,1,23,11],[32,1,32,11],[1,1,1,11],[9,10,9,11],[6,1,6,7],[9,8,9,9],[8,5,8,7],[2,1,2,3],[8,10,8,11],[3,1,3,4],[4,1,5,4],[5,7,5,8],[4,9,4,10],[3,5,3,6],[4,7,4,8],[4,5,5,6],[7,1,7,7],[34,1,34,11],[36,1,36,2],[36,3,36,11],[37,1,37,2],[38,3,38,11],[38,1,41,2],[37,3,37,11],[39,3,39,11],[41,3,41,11],[35,1,35,11],[58,3,58,9],[57,3,57,9],[57,10,57,11],[58,10,58,11],[50,1,50,11],[51,3,52,11],[58,1,58,2],[55,1,55,11],[51,1,52,2]]}
[]
[null,"PERCENT BASED CONSERVATION PRACTICE ASSISTANCE CONTRACT"]
[null,"General Information"]
[null," Organization:",null,null,null," Contract Number:",null," Amendment Date(s)",null," Canceled Dates(s)"]
[null,{"$f":"'Instructions - Menu'!C13","v":0},null,null,null,{"$f":"'Instructions - Menu'!J13","v":0}]
[]
[null,"*If contract amended, attach amendment form(s) to this contract."]
[null,"Applicant (Landowner or Authorized Agent)"]
[null,"Name",null,null,null," Address",null,null," City/State",null," Zip Code"]
[null,{"$f":"'Instructions - Menu'!C19","v":0},null,null,null,{"$f":"'Instructions - Menu'!F19","v":0},null,null,{"$f":"'Instructions - Menu'!J19","v":0},null,{"$f":"'Instructions - Menu'!N19","v":0}]
[null,"* If a group contract, this must be filed and signed by the group spokesperson as designated in the group agreement and the group agreement attached to this form."]
[null,"Conservation Practice Location"]
[null," Township Name:",null,null,null,null,null,"Township No:","Range No.:","Section No.","1/4,1/4"]
[null,{"$f":"'Instructions - Menu'!C24","v":0},null,null,null,null,null,{"$f":"'Instructions - Menu'!I24","v":0},{"$f":"'Instructions - Menu'!J24","v":0},{"$f":"'Instructions - Menu'!M24","v":0},{"$f":"'Instructions - Menu'!O24","v":0}]
[null,"Contract Information"]
[null,"I (we), the undersigned, do hereby request assistance to help defray the cost of installing the following practice(s) listed on the second page of this contract.  It is understood that:"]
[null,"1.       The landowner and/or authorized agent is responsible for full establishment, operation, and maintenance of the practice(s) and upland treatment criteria applied under this program to ensure that the conservation objectives are met, and the effective life is achieved. The specific operation and maintenance requirements for the conservation practice(s) listed are described in the Operation and Maintenance Plan prepared for this contract by the technical assistance provider."]
[]
[null,{"$f":"\"2.       Should the landowner and/or authorized agent fail to complete or maintain the practice(s) during the effective life, they are liable to the organization for up to \"&IF('Instructions - Menu'!J15=\"\",\"_______\",VALUE('Instructions - Menu'!J15*100))&\"% of the amount of financial assistance received to install and establish the practice(s) \"","v":"2.       Should the landowner and/or authorized agent fail to complete or maintain the practice(s) during the effective life, they are liable to the organization for up to _______% of the amount of financial assistance received to install and establish the practice(s) "}]
[null,"unless the failure was caused by reasons beyond their control or if conservation practices are applied at their expense that provide equivalent protection of the soil and water resources."]
{"$rows_left_out":40}
{"sheet":"Flat Rate Contract","index":2,"n_rows":54,"n_cols":11,"rows_kept":54,"cut":false,"hidden":false,"merged":[[42,7,43,7],[42,8,43,8],[42,9,43,9],[51,1,51,11],[44,1,44,5],[44,10,44,11],[45,1,45,5],[45,10,45,11],[33,1,33,11],[25,1,25,11],[27,1,27,11],[34,1,34,2],[34,3,34,11],[26,1,26,11],[30,1,30,11],[31,1,31,11],[32,1,32,11],[52,1,53,2],[52,3,53,9],[52,10,52,11],[53,10,53,11],[36,1,39,2],[36,3,36,11],[37,3,37,11],[39,3,39,11],[49,1,49,2],[48,3,48,11],[49,3,49,11],[47,1,47,10],[48,1,48,2],[42,1,43,5],[42,10,43,11],[42,6,43,6],[3,1,4,5],[7,5,7,7],[35,1,35,2],[35,3,35,11],[41,1,41,11],[19,1,19,11],[14,1,14,11],[22,2,22,10],[18,1,18,11],[15,1,16,11],[20,1,20,11],[23,1,23,11],[21,1,21,11],[24,1,24,11],[28,1,28,11],[29,1,29,11],[11,1,11,6],[11,10,11,11],[8,8,8,9],[12,1,12,6],[12,10,12,11],[8,10,8,11],[8,1,8,4],[8,5,8,7],[0,1,0,11],[1,1,1,3],[7,8,7,9],[7,10,7,11],[5,1,5,7],[7,1,7,4],[2,8,2,9],[2,10,2,11],[4,8,4,9],[4,10,4,11],[6,1,6,7],[2,6,2,7],[3,6,4,7],[3,8,3,9],[3,10,3,11],[2,1,2,5]]}
[null,"FLAT RATE BASED CONSERVATION PRACTICE ASSISTANCE CONTRACT"]
[null,"General Information"]
[null," Organization:",null,null,null,null," Contract Number:",null,"Amendment",null,"Canceled"]
[null,{"$f":"'Instructions - Menu'!C13","v":0},null,null,null,null,{"$f":"'Instructions - Menu'!J13","v":0},null,"Date(s):",null,"Date(s):"]
[]
[null,"*If contract amended, attach amendment form(s) to this contract."]
[null,"Applicant (Landowner or Authorized Agent)"]
[null,"Name",null,null,null,"Address",null,null,"City/State",null,"Zip code"]
[null,{"$f":"'Instructions - Menu'!C19","v":0},null,null,null,{"$f":"'Instructions - Menu'!F19","v":0},null,null,{"$f":"'Instructions - Menu'!J19","v":0},null,{"$f":"'Instructions - Menu'!N19","v":0}]
[null,"* If a group contract, this must be filed and signed by the group spokesperson as designated in the group agreement and the group agreement attached to this form."]
[null,"Conservation Practice Location"]
[null,"Township Name:",null,null,null,null,null,"Township No:","Range No.:","Section No.","1/4,1/4"]
[null,{"$f":"'Instructions - Menu'!C24","v":0},null,null,null,null,null,{"$f":"'Instructions - Menu'!I24","v":0},{"$f":"'Instructions - Menu'!J24","v":0},{"$f":"'Instructions - Menu'!M24","v":0},{"$f":"'Instructions - Menu'!O24","v":0}]
[null,"Contract Information"]
[null,"I (we), the undersigned, do hereby request assistance to help defray the cost of completing the following practice(s) listed on the second page of this contract.  It is understood that:"]
[null,"1.       The landowner and/or authorized agent is responsible for full establishment, operation, and maintenance of the practice(s) applied under this program to ensure that the conservation objectives are met, and the effective life is achieved. The specific operation and maintenance requirements for the conservation practice listed are described in the Operation and Maintenance Plan prepared for this contract by the technical assistance provider."]
[]
[]
[null,{"$f":"\"2.       Should the landowner and/or authorized agent fail to complete or maintain the practice(s) during the effective life, they are liable to the organization for up to \"&IF('Instructions - Menu'!J15=\"\",\"_______\",VALUE('Instructions - Menu'!J15*100))&\"% of the amount of financial assistance received to complete the practice(s) \"","v":"2.       Should the landowner and/or authorized agent fail to complete or maintain the practice(s) during the effective life, they are liable to the organization for up to _______% of the amount of financial assistance received to complete the practice(s) "}]
[null,"unless the failure was caused by reasons beyond their control or if conservation practices are applied at their expense that provide equivalent protection of the soil and water resources."]
{"$rows_left_out":35}
{"sheet":"Percent Based Voucher","index":3,"n_rows":40,"n_cols":18,"rows_kept":40,"cut":false,"hidden":false,"merged":[[19,10,19,11],[18,6,18,7],[18,8,18,9],[23,5,23,7],[14,0,14,3],[16,0,16,3],[9,0,9,3],[5,8,5,9],[23,0,23,3],[13,0,13,3],[19,1,19,2],[19,4,19,5],[19,6,19,7],[25,5,25,7],[2,9,2,11],[2,2,2,5],[3,2,3,11],[22,5,22,7],[22,0,22,3],[7,0,7,3],[4,2,4,11],[6,0,6,2],[8,0,8,3],[17,0,17,11],[10,0,10,3],[11,0,11,3],[26,5,26,7],[26,0,26,3],[24,10,24,11],[24,8,24,9],[27,9,27,10],[27,5,27,7],[27,0,27,3],[24,0,24,3],[0,0,0,11],[38,0,38,3],[28,5,28,7],[38,7,38,10],[35,0,35,3],[35,5,35,11],[31,5,31,7],[31,0,31,3],[36,0,36,3],[36,5,36,11],[32,0,32,3],[33,9,33,11],[12,0,12,3],[15,0,15,11],[28,0,28,3],[25,0,25,3]]}
[]
["PAYEE AND COST INFORMATION"]
["Name:",null,{"$f":"'Instructions - Menu'!C19","v":0},null,null,null,null,"Contract No.:",null,{"$f":"'Instructions - Menu'!J13","v":0}]
["Address:",null,{"$f":"'Instructions - Menu'!F19","v":0}]
["City, State, Zip:",null,{"$f":"_xlfn.CONCAT('Instructions - Menu'!J19:M19,\"  \",'Instructions - Menu'!N19:O19)","v":"  "}]
["Total Amount Authorized:",null,{"$f":"IF('Contract Amendment Form'!I18>0,'Contract Amendment Form'!I18,'Instructions - Menu'!J30)","v":0},"      % Approved: ",null,{"$f":"'Instructions - Menu'!C30","v":0},"(state)",null,{"$f":"'Instructions - Menu'!G30","v":0},null,"(state & non-state)"]
["(from contract)"]
["Item",null,null,null,null,"Quantity",null,"Unit",null,"Unit Price",null,"Cost"]
[null,null,null,null,null,null,null,null,null,null,null,{"$f":"F9*J9","v":0}]
[null,null,null,null,null,null,null,null,null,null,null,0]
[null,null,null,null,null,null,null,null,null,null,null,0]
[null,null,null,null,null,null,null,null,null,null,null,0]
[null,null,null,null,null,null,null,null,null,null,null,0,null,null,null,null,null,"Partial"]
[null,null,null,null,null,null,null,null,null,null,null,0,null,null,null,null,null,"Final"]
[null,null,null,null,null,null,null,null,null,null,null,0]
[]
[null,null,null,null,null,null,null,null,null,"PROJECT COST:",null,{"$f":"SUM(L9:L15)","v":0}]
["I certify I have received and reviewed the operation and maintenance plan and that this is an accurate and true summation of the actual costs and quantities of material, labor, and equipment used on the above project.  In cases where the receipts included items not used on the project, I have corrected them accordingly."]
[]
["Payee Signature",null,null,null,null,null,null,null,null,"Date"]
{"$rows_left_out":21}
{"sheet":"Flat Rate Voucher","index":4,"n_rows":37,"n_cols":18,"rows_kept":37,"cut":false,"hidden":false,"merged":[[7,0,7,3],[2,2,2,11],[3,2,3,11],[5,2,5,3],[5,8,5,11],[4,2,4,11],[19,0,19,5],[19,9,19,11],[8,0,8,3],[9,0,9,3],[10,0,10,3],[11,0,11,3],[12,0,12,3],[13,0,13,3],[14,0,14,3],[15,0,15,11],[16,0,16,3],[17,0,17,11],[18,0,18,8],[18,9,18,11],[27,0,27,3],[27,5,27,7],[20,0,20,6],[20,9,20,11],[23,0,23,3],[23,5,23,7],[24,0,24,3],[24,5,24,7],[35,0,35,3],[35,7,35,10],[0,0,0,11],[1,0,1,11],[29,0,29,3],[29,5,29,7],[30,0,30,3],[32,0,32,3],[32,5,32,11],[33,0,33,3],[33,5,33,11],[25,0,25,3],[25,5,25,7],[25,10,25,11],[26,0,26,3],[26,5,26,7]]}
["FLAT RATE - VOUCHER AND PRACTICE CERTIFICATION FORM"]
["PAYEE AND COST INFORMATION"]
["Name:",null,{"$f":"'Instructions - Menu'!C19:E19","v":0}]
["Address:",null,{"$f":"'Instructions - Menu'!F19","v":0}]
["City, State, Zip:",null,{"$f":"_xlfn.CONCAT('Instructions - Menu'!J19:M19,\"  \",'Instructions - Menu'!N19:O19)","v":"  "}]
["    Contract No.:",null,{"$f":"'Instructions - Menu'!J13","v":0},null,null,"Total Amount Authorized:",null,null,{"$f":"IF('Contract Amendment Form'!I18>0,'Contract Amendment Form'!I18,'Instructions - Menu'!J30)","v":0}]
[null,null,null,null,null,"(from contract)"]
["Practice",null,null,null,null,"Quantity",null,"Unit",null,"Unit Rate",null,"Total"]
[null,null,null,null,null,null,null,null,null,null,null,{"$f":"F9*J9","v":0}]
[null,null,null,null,null,null,null,null,null,null,null,0]
[null,null,null,null,null,null,null,null,null,null,null,0]
[null,null,null,null,null,null,null,null,null,null,null,0]
[null,null,null,null,null,null,null,null,null,null,null,0,null,null,null,null,null,"Partial"]
[null,null,null,null,null,null,null,null,null,null,null,0,null,null,null,null,null,"Final"]
[null,null,null,null,null,null,null,null,null,null,null,0]
[]
[null,null,null,null,null,null,null,null,null,"PAYMENT REQUEST:",null,{"$f":"SUM(L9:L15)","v":0}]
[]
["I certify I have received and reviewed the operation and maintenance plan and that this is an accurate and true summation of the above project, which was completed on:"]
[]
{"$rows_left_out":18}
{"sheet":"Contract Amendment Form","index":5,"n_rows":51,"n_cols":9,"rows_kept":51,"cut":false,"hidden":false,"merged":[[3,0,7,3],[3,4,7,5],[3,6,7,7],[15,5,15,7],[22,0,22,9],[21,3,21,4],[21,6,21,7],[21,8,21,9],[15,8,15,9],[15,3,15,4],[17,8,17,9],[17,3,17,4],[18,0,18,2],[17,0,17,2],[17,5,17,7],[18,3,18,4],[0,0,0,9],[2,8,2,9],[2,6,2,7],[2,4,2,5],[2,0,2,3],[41,2,42,9],[40,2,40,4],[9,0,11,9],[33,0,34,9],[36,0,36,7],[39,0,39,1],[41,0,42,1],[39,2,39,9],[25,0,31,9],[13,0,13,3],[20,6,20,7],[20,3,20,4],[24,0,24,9],[15,0,15,2],[18,5,18,7],[18,8,18,9],[44,0,44,9],[50,0,50,5],[43,0,43,3],[46,0,46,1],[46,2,46,9],[45,2,45,4],[47,0,47,2],[48,2,48,4],[49,0,49,1],[49,2,49,9]]}
["AMENDMENT TO CONSERVATION PRACTICE ASSISTANCE CONTRACT "]
[]
["Organization:",null,null,null,"Contract Number:",null,"Amendment Number:",null,"Amendment Type"]
[{"$f":"'Instructions - Menu'!C13","v":0},null,null,null,{"$f":"'Instructions - Menu'!J13","v":0},null,null,null,"Install/Completion Date"]
[null,null,null,null,null,null,null,null,"Total Amount Authorized"]
[null,null,null,null,null,null,null,null," Landowner/Auth. Agent"]
[null,null,null,null,null,null,null,null," Practice"]
[null,null,null,null,null,null,null,null,"Other:"]
[]
[]
[]
[]
[]
["State Grant Agreement Expiration Date:"]
[]
["Original Contract Install/Completion Date:",null,null,{"$f":"'Instructions - Menu'!F15","v":0},null,"Amended Contract Install/Completion Date:"]
[]
["Original Total Amount Authorized:",null,null,{"$f":"'Instructions - Menu'!J30","v":0},null,"Amended Total Amount Authorized:"]
["Original Landowner/Authorized Agent:",null,null,{"$f":"'Instructions - Menu'!C19","v":0},null,"Amended Landowner/Authorized Agent:"]
[]
{"$rows_left_out":32}
{"sheet":"Practice Inspection Form","index":6,"n_rows":37,"n_cols":8,"rows_kept":37,"cut":false,"hidden":false,"merged":[[20,4,20,7],[21,4,21,7],[6,0,6,1],[14,0,15,0],[16,4,16,7],[17,4,17,7],[18,4,18,7],[19,4,19,7],[7,2,7,4],[10,6,10,7],[11,6,11,7],[14,4,15,7],[6,2,6,4],[6,5,6,6],[7,5,7,6],[41,0,42,4],[41,5,42,6],[32,0,32,7],[28,2,28,7],[33,0,33,7],[0,0,0,7],[13,0,13,7],[14,1,15,1],[14,2,15,2],[14,3,15,3],[4,2,4,3],[3,4,3,5],[4,4,4,5],[7,0,7,1],[3,0,3,1],[4,0,4,1],[3,6,3,7],[4,6,4,7],[3,2,3,3]]}
["PRACTICE SITE INSPECTION FORM"]
[]
["General Information"]
["Organization",null,"Contract Number",null,"Primary Practice",null,"Practice Installed Date"]
[{"$f":"'Instructions - Menu'!C13","v":0},null,{"$f":"'Instructions - Menu'!J13","v":0}]
[]
["Landowner or Authorized Agent",null,"Address",null,null,"City/State",null,"Zip code"]
[{"$f":"'Instructions - Menu'!C19","v":0},null,{"$f":"'Instructions - Menu'!F19","v":0},null,null,{"$f":"'Instructions - Menu'!J19","v":0},null,{"$f":"'Instructions - Menu'!N19","v":0}]
[]
["Conservation Practice Location"]
["Township Name","Township No.","Range No.","Section No.","1/4,1/4","County Number","Minor Watershed Number"]
[{"$f":"'Instructions - Menu'!C24","v":0},{"$f":"'Instructions - Menu'!I24","v":0},{"$f":"'Instructions - Menu'!J24","v":0},{"$f":"'Instructions - Menu'!M24","v":0},{"$f":"'Instructions - Menu'!O24","v":0}]
[]
["Inspection Information                            "]
["Inspection Date","Name","Practice Condition*","Contributing Watershed Condition*","Suggested Maintenance "]
[]
[]
[]
[]
[]
{"$rows_left_out":18}
{"sheet":"Group Project Addendum Form","index":7,"n_rows":47,"n_cols":9,"rows_kept":47,"cut":false,"hidden":false,"merged":[[26,0,26,10],[29,0,29,10],[24,0,24,2],[41,0,41,10],[42,0,42,2],[42,3,42,6],[42,7,42,10],[36,0,36,2],[36,3,36,6],[39,0,39,2],[33,0,33,2],[33,3,33,6],[33,7,33,10],[30,0,30,2],[30,3,30,6],[23,0,23,10],[39,3,39,6],[39,7,39,10],[14,0,14,10],[16,0,16,10],[18,0,18,10],[32,0,32,10],[36,7,36,10],[24,7,24,10],[27,0,27,2],[27,3,27,6],[30,7,30,10],[27,7,27,10],[24,3,24,6],[35,0,35,10],[38,0,38,10],[0,1,3,9],[5,0,5,3],[21,0,21,2],[21,3,21,6],[21,7,21,10],[12,0,12,4],[7,4,7,10],[8,4,9,10],[7,2,7,3],[8,2,9,3],[7,0,7,1],[8,0,9,1]]}
[null,"CONSERVATION PRACTICE ASSISTANCE CONTRACT\nGROUP PROJECT ADDENDUM"]
[]
[]
[]
[]
["General Information"]
[]
["Contract No.",null,"Date",null,"Group Spokesperson"]
[{"$f":"'Instructions - Menu'!J13","v":0}]
[]
[]
[]
["Applicant Information and Signatures"]
[]
["We (the undersigned) are interested in developing and conserving our soil, water and related resources to meet the objectives of our group.  In order to meet our group objectives, we request assistance to help us plan and apply proper land use and conservation treatment measures as agreed upon by our group."]
[]
["We understand that this help is contingent upon staff assistance from the organization and in conformance with its policies and priorities."]
[]
["We further understand that the below designated group spokesperson is authorized to sign the Conservation Practice Contract* and shall do the negotiating with the organization.  Prior to the approval of this application the spokesperson shall prepare a division of payments schedule agreed to by the undersigned and attach the plan to this form."]
[]
{"$rows_left_out":28}
{"sheet":"Project Checklist","index":8,"n_rows":33,"n_cols":6,"rows_kept":33,"cut":false,"hidden":false,"merged":[[12,1,12,2],[2,3,2,4],[3,0,3,1],[3,3,3,4],[4,0,4,5],[5,0,5,5],[6,1,6,2],[7,1,7,2],[8,1,8,2],[9,0,9,5],[10,1,10,2],[11,1,11,2],[0,0,0,1],[0,3,0,4],[1,0,1,1],[1,3,1,4],[2,0,2,1],[23,1,23,2],[24,1,24,2],[25,0,25,5],[13,1,13,2],[14,1,14,2],[15,0,15,5],[16,1,16,2],[17,1,17,2],[18,1,18,2],[19,1,19,2],[20,1,20,2],[21,0,21,5],[22,1,22,2],[32,1,32,2],[26,1,26,2],[27,1,27,2],[28,1,28,2],[29,1,29,2],[30,0,30,5],[31,1,31,2]]}
["Contract Number",null,"Project Manager","Applicant",null,"Landowner(s), if different"]
[{"$f":"'Instructions - Menu'!J13","v":0}]
["Technical Assistance Provider: ",null,"Technical Standard(s): ","Conservation Practices",null,"Funding Sources: "]
[]
[]
["PROJECT INVESTIGATION & TECHNICAL ASSESSMENT"]
["Done","Tasks",null,"Date","Initials","Documentation"]
[null,"Conducted Field Investigation of the Problem",null,null,null,"Site photos, survey notes"]
[null,"Technical Assessement Completed",null,null,null,"TA form"]
["APPLICATION & CONTRACTING"]
["Done","Tasks",null,"Date","Initials","Documentation"]
[null,"Application Completed",null,null,null,"Cost-share application (% or flat-rate)"]
[null,"Contract approved & signed",null,null,null,"Signed contract"]
[null,"Action documented in minutes",null,null,null,"Copy of signed minutes"]
[null,"Approval / Denial letter sent",null,null,null,"Copy of letter"]
["PRACTICE DESIGN"]
["Done","Tasks",null,"Date","Initials","Documentation"]
[null,"Final Design completed",null,null,null,"Final plans, specifications, bid documents (if applicable)"]
[null,"Operation & Maintenance Plan completed",null,null,null,"Signed O&M Plan"]
[null,"Contractor bid submitted (if required locally)",null,null,null,"Copy of completed bid(s), prevailing wage statement (if applicable)"]
{"$rows_left_out":14}
{"sheet":"Technical Assessment","index":9,"n_rows":41,"n_cols":6,"rows_kept":41,"cut":false,"hidden":false,"merged":[[2,0,2,1],[2,2,2,5],[3,0,3,1],[3,2,3,5],[5,0,5,5],[11,2,11,5],[12,2,12,5],[13,2,13,5],[14,0,14,5],[15,2,15,5],[6,0,6,5],[7,0,7,5],[8,0,8,5],[9,0,9,5],[10,2,10,5],[21,0,21,5],[22,2,22,5],[23,2,23,5],[24,1,24,5],[25,0,25,5],[16,2,16,5],[17,2,17,5],[18,2,18,5],[19,2,19,5],[20,1,20,5],[31,1,31,5],[32,0,32,5],[33,0,33,5],[34,1,34,5],[35,0,35,5],[26,0,26,5],[27,0,27,5],[28,0,28,5],[29,0,29,5],[30,0,30,5],[36,2,36,3],[36,4,36,5],[40,0,40,5],[41,0,41,5],[37,2,37,3],[37,4,37,5],[38,2,38,3],[38,4,38,5],[39,2,39,3],[39,4,39,5]]}
["Applicant","Landowner(s), if different","Township","Range","Section","1/4, 1/4"]
[]
["Has permission been granted to access the parcel?",null,"Technical Assistance Provider"]
[]
[]
["Nature of the problem and overall resource management needs of the area where the problem is occurring: "]
[]
["Possible conservation or management practice(s) needed to effectively treat the problem: "]
[]
["Recommendation and cost estimate: "]
["Recommended Practice(s)","Practice Code(s)","Preliminary Cost Estimate"]
[]
[]
[]
["Potential adverse impacts of the identifed solution(s): "]
["Cultural resources (including historical): "]
["Threatened & endagered species: "]
["Wetlands: "]
["Floodplains: "]
["Other: "]
{"$rows_left_out":21}